Error zlib h no such file or directory

h: 19: 18: error: zlib. h: No such file or directory. error: asm/ errno. h: No such file or directory # include. why on this beautiful planet are you building such blem description error: cairo. h: No such file or directory Exact command line call triggering the problem make prefix= / home/ linuxbrew/. linuxbrew/ Cellar/ genometools/ 1. 9 64bit= yes Example minimal input triggering the problem NA What G. No, it can' t find the zlib. h header file; zlib provides support for the gzip compression algorithm. I' m going to guess that you don' t have the kernel- headers installed; that' s where zlib. h lives in my installation. zlib- devel がインストールされていないと zlib. h がないため、 OpenSSLのビルドが失敗 します。 yum コマンドで. そのようなファイルやディレクトリはありません # include < zlib.

  • Git clone error 502
  • Xml parsing fatal error invalid document structure
  • Status 500 an internal application error occurred webide
  • Error no 2003 mysql


  • Video:Zlib file directory

    Error such directory

    h> ^ コンパイルを停止しました。 make[ 2] : * * * [ c_ zlib. c: 31: 20: fatal error: Python. compilation terminated. The nixCraft takes a lot of my time and hard work to produce. fatal error: zlib. h : No such file or directory 共有140篇相关文章: fatal error: zlib. h : No such file or directory visual studio 报错 集锦 fatal error C1083: Cannot open precompiled header file:. libavcodec/ pngdec. c: 35: 18: fatal error: zlib. you did not install the - devel rpm for zlib.

    Code: su - yum search stalling on Linux Mint 17. 2 Rafaela gives: npm install csscritic npm WARN package. json [email protected] No description npm WARN package. json [email protected] No repository field. npm WARN package. json [email protected] No README data npm WARN packa. Zlib Compile Errors. Error Making zlib make: * * * [ all] Error 1 Error 0x5. Qt build fails under Windows, missing zlib. fatal error C1083: Cannot open include file: ' zlib. Cannot open include file: ' zlib.

    h' : No such file or directory. h: No such file or directory" but zlib is installed and confirmed via Spack. ' DEBUG= no' ' CC= / usr/ bin/ gcc- 6' 1 error found in build log : 13 / usr/ bin/ gcc- 6 - o buckets/ barrier_ buckets. o - c - std= pilation error - missing zlib. How to fix fatal error: zlib. h: no such file or directory? h file in usr/ local/ include how to get it. configure: CHECKS for programs checking for cc. no checking for gcc. no configure: error: no acceptable C. h: 16: 18: error: zlib. エラーが出た。 zlib. hが無いらしい。 % sudo apt- get install. I' m trying to make GROMACS the error I' m getting is : fatal error: glib.

    h: No such file or directory I' ve seen that there are already questions related to this, and I followed their advice and r. Dear sir or madame I am trying to upgrade my NAS with anew toolchain, gcc- 4. 2 The NAS have been " hacked" fonz_ plug, that contain a om / home/ mallikarjun/ opencv- 3. 0/ 3rdparty/ zlib/ zlib. fatal error: limits. h: No such file or directory compilation terminated. These are some common errors that you might face when you try to build/ compile/ install something from source on Ubuntu Linux Server/ Desktop: fatal error: openssl/ ssl. h: No such file or directory fatal error: zlib. h: No such file or directory fatal error: png. h: No such file or directory fatal error: curl/ curl. h: No such file or directory fatal. You' re missing to set the include path to where you put the zlib header files. Setting the LD_ LIBRARY_ PATH environment variable is for dynamic linking of shared objects ( DLLs, that is the files ending with. kaeltran changed the title from make error. h: no such file or directory to Building on Fedora 20.

    h: no such file or directory May 21,. How to install zlib libgcrypt using apt- get? But when I compile a c program having < zlib. c> it gives this error: no such file or directory. You can try and use python- dev instead, it includes header files, a static library and development tools for building Python modules, extending the Python interpreter or embedding Python in applications. To install this package. C+ + fatal error: zlib. Go back to Richel Bilderbeek' s C+ + page. h: No such file or directory · Install error that can occur when installing Boost. After doing the following, the error pops up:. I have never built a project in Ubuntu before and I am trying to come to grips with the GNU build tools and process. When I try to make I get the glib. h - no such file or directory. Hi, I have problem with " zlib" when I install the Axis SDK software( devboard- R2_ 01. gz) on my Linux computer Mandrake 10.

    How to solve the zlib. h missing problem without root right # 1: seasoul. The first error occurred is " fatal error: zlib. Can' t compile libpng 1. 6 on windows via cmake: Cannot open include file: ' zlib. fatal error: zlib/ zlib. then how has Message. cpp been including zlib. com/ freeorion/ freeorion. h not found Last modified:. x86_ 64- linux- gnu- g+ + - c - g - DIN_ GCC. ビルドをしていて zlib. h がないというコンパイルエラーになったとします。 apt- get で持っ てくるにはどの.

    まず、 apt- file というコマンドをインストールして準備。 $ sudo apt- get install. How to find and install the missing file in& nbsp; Ubuntu. Thanks - that works. I have another question, if I want to install bamtools to a directory ( e. , $ prefix), by doing: cmake. - DCMAKE_ INSTALL_ PREFIX= $ prefix. You should install the development support files for zlib, try: sudo apt- get install libz- dev. Other package names: zlib1g- dev. If you' ve already zlib library, make sure you' re compiling your code sources with - lz. h: No such file or directory zlib is installed: rpm - qa | grep zlib zlib1- 1.